Target
cGMP-dependent 3',5'-cyclic phosphodiesterase
Ligand
BDBM50236271
Substrate
Meas. Tech.
ChEMBL_1658902 (CHEMBL4008514)
IC50
1±n/a nM
Citation
 Gomez, LMassari, MEVickers, TFreestone, GVernier, WLy, KXu, RMcCarrick, MMarrone, TMetz, MYan, YGYoder, ZWLemus, RBroadbent, NJBarido, RWarren, NSchmelzer, KNeul, DLee, DAndersen, CBSebring, KAertgeerts, KZhou, XTabatabaei, APeters, MBreitenbucher, JG Design and Synthesis of Novel and Selective Phosphodiesterase 2 (PDE2a) Inhibitors for the Treatment of Memory Disorders. J Med Chem 60:2037-2051 (2017)  
Target
Name:
cGMP-dependent 3',5'-cyclic phosphodiesterase
Synonyms:
CGS-PDE Homo sapiens phosphodiesterase 2A (PDE2A) PDE2A cGSPDE
Type:
Enzyme Catalytic Domain
Mol. Mass.:
105691.58
Organism:
Homo sapiens (Human)
Description:
O00408
Residue:
941
  
Inhibitor
Name:
BDBM50236271
Synonyms:
CHEMBL4103411 | US11186582, Example 225
Type:
Small organic molecule
Emp. Form.:
C22H19F2N5O
Mol. Mass.:
407.416
SMILES:
Cc1cc(C2CN(CC(F)(F)C2)C(=O)c2ccc3ccccc3c2)n2ncnc2n1
: