Target
D(3) dopamine receptor
Ligand
BDBM84889
Substrate
Meas. Tech.
ChEMBL_1659130 (CHEMBL4008742)
EC50
0.730000±n/a nM
Citation
 De Simone, ARusso, DRuda, GFMicoli, AFerraro, MDi Martino, RMOttonello, GSumma, MArmirotti, ABandiera, TCavalli, ABottegoni, G Design, Synthesis, Structure-Activity Relationship Studies, and Three-Dimensional Quantitative Structure-Activity Relationship (3D-QSAR) Modeling of a Series of O-Biphenyl Carbamates as Dual Modulators of Dopamine D3 Receptor and Fatty Acid Amide Hydrolase. J Med Chem 60:2287-2304 (2017)  
Target
Name:
D(3) dopamine receptor
Synonyms:
DOPAMINE D3 DRD3_HUMAN Dopamine D3 receptor (D3) Dopamine receptor Dopamine receptor D3
Type:
Mol. Mass.:
44243.43
Organism:
Homo sapiens (Human)
Description:
Residue:
400
  
Inhibitor
Name:
BDBM84889
Synonyms:
THC, 11-OH-delta 8 | THC-DMH, (+)-11-OH
Type:
Small organic molecule
Emp. Form.:
C25H38O3
Mol. Mass.:
386.5674
SMILES:
CCCCCCC(C)(C)c1cc(O)c2[C@@H]3C=C(CO)CC[C@H]3C(C)(C)Oc2c1
: