Target
Fatty-acid amide hydrolase 1
Ligand
BDBM50236344
Substrate
Meas. Tech.
ChEMBL_1659125 (CHEMBL4008737)
IC50
3.3±n/a nM
Citation
 De Simone, ARusso, DRuda, GFMicoli, AFerraro, MDi Martino, RMOttonello, GSumma, MArmirotti, ABandiera, TCavalli, ABottegoni, G Design, Synthesis, Structure-Activity Relationship Studies, and Three-Dimensional Quantitative Structure-Activity Relationship (3D-QSAR) Modeling of a Series of O-Biphenyl Carbamates as Dual Modulators of Dopamine D3 Receptor and Fatty Acid Amide Hydrolase. J Med Chem 60:2287-2304 (2017)  
Target
Name:
Fatty-acid amide hydrolase 1
Synonyms:
Anandamide amidohydrolase FAAH FAAH1_HUMAN Fatty-acid amide hydrolase (FAAH) Oleamide hydrolase 1
Type:
Protein
Mol. Mass.:
63071.19
Organism:
Homo sapiens (Human)
Description:
O00519
Residue:
579
  
Inhibitor
Name:
BDBM50236344
Synonyms:
CHEMBL4103339
Type:
Small organic molecule
Emp. Form.:
C26H27Cl2N3O2
Mol. Mass.:
484.417
SMILES:
Clc1cccc(N2CCN(CCCNC(=O)Oc3ccc(cc3)-c3ccccc3)CC2)c1Cl
: