Target
Amine oxidase [flavin-containing] B
Ligand
BDBM50240772
Substrate
Meas. Tech.
ChEBML_1659162
IC50
800±n/a nM
Citation
 Sartori, LMercurio, CAmigoni, FCappa, AFagá, GFattori, RLegnaghi, ECiossani, GMattevi, AMeroni, GMoretti, LCecatiello, VPasqualato, SRomussi, AThaler, FTrifiró, PVilla, MVultaggio, SBotrugno, OADessanti, PMinucci, SZagarrí, ECarettoni, DIuzzolino, LVarasi, MVianello, P Thieno[3,2-b]pyrrole-5-carboxamides as New Reversible Inhibitors of Histone Lysine Demethylase KDM1A/LSD1. Part 1: High-Throughput Screening and Preliminary Exploration. J Med Chem 60:1673-1692 (2017)  
Target
Name:
Amine oxidase [flavin-containing] B
Synonyms:
AOFB_HUMAN MAOB Monoamine oxidase type B (MAO B) Monoamine oxidase type B (MAOB)
Type:
Protein
Mol. Mass.:
58768.76
Organism:
Homo sapiens (Human)
Description:
P27338
Residue:
520
  
Inhibitor
Name:
BDBM50240772
Synonyms:
(1R,2S)-(-)-2-phenylcyclopropylamine (tranylcypromine)2-Phenyl-cyclopropylamine CHEMBL1179 TRANYLCYPROMINE US10836743, Compound TCP US9180183, Tranylcypromine rel-Tranylcypromine
Type:
Small organic molecule
Emp. Form.:
C9H11N
Mol. Mass.:
133.1903
SMILES:
N[C@@H]1C[C@H]1c1ccccc1
: