Target
Lysine-specific histone demethylase 2
Ligand
BDBM50236441
Substrate
Meas. Tech.
ChEBML_1659184
IC50
16600±n/a nM
Citation
 Vianello, PSartori, LAmigoni, FCappa, AFagá, GFattori, RLegnaghi, ECiossani, GMattevi, AMeroni, GMoretti, LCecatiello, VPasqualato, SRomussi, AThaler, FTrifiró, PVilla, MBotrugno, OADessanti, PMinucci, SVultaggio, SZagarrí, EVarasi, MMercurio, C Thieno[3,2-b]pyrrole-5-carboxamides as New Reversible Inhibitors of Histone Lysine Demethylase KDM1A/LSD1. Part 2: Structure-Based Drug Design and Structure-Activity Relationship. J Med Chem 60:1693-1715 (2017)  
Target
Name:
Lysine-specific histone demethylase 2
Synonyms:
AOF1 Flavin-containing amine oxidase domain-containing protein 1 KDM1B_HUMAN Lysine-specific histone demethylase 1B | Lysine-specific histone demethylase 2
Type:
PROTEIN
Mol. Mass.:
92112.91
Organism:
Homo sapiens (Human)
Description:
ChEMBL_992590
Residue:
822
  
Inhibitor
Name:
BDBM50236441
Synonyms:
CHEMBL4072541
Type:
Small organic molecule
Emp. Form.:
C28H31N3O4S
Mol. Mass.:
505.628
SMILES:
COCc1cccc(NC(=O)c2cc3sccc3n2C)c1COc1ccc(OC[C@@H]2CCNC2)cc1
: