Target
Dual specificity tyrosine-phosphorylation-regulated kinase 1B
Ligand
BDBM50236541
Substrate
Meas. Tech.
ChEBML_1659284
IC50
17±n/a nM
Citation
 Zhou, QPhoa, AFAbbassi, RHHoque, MReekie, TAFont, JSRyan, RMStringer, BWDay, BWJohns, TGMunoz, LKassiou, M Structural Optimization and Pharmacological Evaluation of Inhibitors Targeting Dual-Specificity Tyrosine Phosphorylation-Regulated Kinases (DYRK) and CDC-like kinases (CLK) in Glioblastoma. J Med Chem 60:2052-2070 (2017)  
Target
Name:
Dual specificity tyrosine-phosphorylation-regulated kinase 1B
Synonyms:
DYR1B_HUMAN Dual specificity tyrosine-phosphorylation-regulated kinase 1B MIRK
Type:
Enzyme
Mol. Mass.:
69222.24
Organism:
Homo sapiens (Human)
Description:
Q9Y463
Residue:
629
  
Inhibitor
Name:
BDBM50236541
Synonyms:
CHEMBL4067661
Type:
Small organic molecule
Emp. Form.:
C20H16N4O2
Mol. Mass.:
344.3666
SMILES:
NC(=O)Nc1ccc(cc1)-c1cnc2[nH]cc(-c3ccc(O)cc3)c2c1
: