Target
5-hydroxytryptamine receptor 1A
Ligand
BDBM50016738
Substrate
Meas. Tech.
ChEMBL_1660365 (CHEMBL4009977)
Ki
2.5±n/a nM
Citation
 Glennon, RA The 2014 Philip S. Portoghese Medicinal Chemistry Lectureship: The"Phenylalkylaminome" with a Focus on Selected Drugs of Abuse. J Med Chem 60:2605-2628 (2017)  
Target
Name:
5-hydroxytryptamine receptor 1A
Synonyms:
5-HT-1A 5-HT1A 5-hydroxytryptamine receptor 1A (5HT1A) 5ht1a Htr1a Serotonin 1a (5-HT1a) receptor/Adrenergic receptor alpha-1 | Serotonin receptor 1A
Type:
G Protein-Coupled Receptor (GPCR)
Mol. Mass.:
46445.29
Organism:
Rattus norvegicus (rat)
Description:
Binding assays were performed using rat hippocampal membranes.
Residue:
422
  
Inhibitor
Name:
BDBM50016738
Synonyms:
(8-Methoxy-1,2,3,4-tetrahydro-naphthalen-2-yl)-(3-phenyl-propyl)-amine | CHEMBL27609
Type:
Small organic molecule
Emp. Form.:
C20H25NO
Mol. Mass.:
295.4186
SMILES:
COc1cccc2CCC(Cc12)NCCCc1ccccc1
: