Target
Disintegrin and metalloproteinase domain-containing protein 17
Ligand
BDBM50236612
Substrate
Meas. Tech.
ChEBML_1661178
IC50
82±n/a nM
Citation
 Ouvry, GBerton, YBhurruth-Alcor, YBonnary, LBouix-Peter, CBouquet, KBourotte, MChambon, SComino, CDeprez, BDuvert, DDuvert, GHacini-Rachinel, FHarris, CSLuzy, APMathieu, AMillois, CPascau, JPinto, APolge, GReitz, AReversé, KRosignoli, CTaquet, NHennequin, LF Identification of novel TACE inhibitors compatible with topical application. Bioorg Med Chem Lett 27:1848-1853 (2017)  
Target
Name:
Disintegrin and metalloproteinase domain-containing protein 17
Synonyms:
ADA17_MOUSE Adam17 TNF-alpha-converting enzyme | Tace
Type:
Enzyme Catalytic Domain
Mol. Mass.:
93046.10
Organism:
Mus musculus (Mouse)
Description:
Q9Z0F8
Residue:
827
  
Inhibitor
Name:
BDBM50236612
Synonyms:
CHEMBL4071465
Type:
Small organic molecule
Emp. Form.:
C23H25N3O6S
Mol. Mass.:
471.526
SMILES:
Cc1cc(COc2ccc(cc2)S(=O)(=O)N[C@@H]2CCC[C@]2(O)C(=O)NO)c2ccccc2n1
: