Target
Leucine-rich repeat serine/threonine-protein kinase 2
Ligand
BDBM50236734
Substrate
Meas. Tech.
ChEMBL_1660538 (CHEMBL4010150)
IC50
44±n/a nM
Citation
 Scott, JDDeMong, DEGreshock, TJBasu, KDai, XHarris, JHruza, ALi, SWLin, SILiu, HMacala, MKHu, ZMei, HZhang, HWalsh, PPoirier, MShi, ZCXiao, LAgnihotri, GBaptista, MAColumbus, JFell, MJHyde, LAKuvelkar, RLin, YMirescu, CMorrow, JAYin, ZZhang, XZhou, XChang, RKEmbrey, MWSanders, JMTiscia, HEDrolet, REKern, JTSur, SMRenger, JJBilodeau, MTKennedy, MEParker, EMStamford, AWNargund, RMcCauley, JAMiller, MW Discovery of a 3-(4-Pyrimidinyl) Indazole (MLi-2), an Orally Available and Selective Leucine-Rich Repeat Kinase 2 (LRRK2) Inhibitor that Reduces Brain Kinase Activity. J Med Chem 60:2983-2992 (2017)  
Target
Name:
Leucine-rich repeat serine/threonine-protein kinase 2
Synonyms:
Dardarin LRRK2_HUMAN Leucine-rich repeat serine/threonine-protein kinase 2 PARK8
Type:
Protein
Mol. Mass.:
286113.20
Organism:
Homo sapiens (Human)
Description:
Q5S007
Residue:
2527
  
Inhibitor
Name:
BDBM50236734
Synonyms:
CHEMBL4071886
Type:
Small organic molecule
Emp. Form.:
C20H18N4O2S
Mol. Mass.:
378.448
SMILES:
CN(c1cccc(c1)S(C)(=O)=O)c1ccc2[nH]nc(-c3ccncc3)c2c1
: