Target
D(1A) dopamine receptor
Ligand
BDBM50236956
Substrate
Meas. Tech.
ChEBML_1660542
Ki
2900±n/a nM
Citation
 Möller, DBanerjee, AUzuneser, TCSkultety, MHuth, TPlouffe, BHübner, HAlzheimer, CFriedland, KMüller, CPBouvier, MGmeiner, P Discovery of G Protein-Biased Dopaminergics with a Pyrazolo[1,5-a]pyridine Substructure. J Med Chem 60:2908-2929 (2017)  
Target
Name:
D(1A) dopamine receptor
Synonyms:
DA D1 receptor DRD1 Dopamine D1 receptor Dopamine D1A
Type:
Enzyme
Mol. Mass.:
49303.43
Organism:
Homo sapiens (Human)
Description:
P21728
Residue:
446
  
Inhibitor
Name:
BDBM50236956
Synonyms:
CHEMBL4069091
Type:
Small organic molecule
Emp. Form.:
C22H24Cl2N6O2
Mol. Mass.:
475.371
SMILES:
O\N=C/c1cnn2ccc(NC(=O)CCCN3CCN(CC3)c3cccc(Cl)c3Cl)cc12
: