Target
D(2) dopamine receptor
Ligand
BDBM50236960
Substrate
Meas. Tech.
ChEMBL_1660544 (CHEMBL4010156)
Ki
0.300000±n/a nM
Citation
 Möller, DBanerjee, AUzuneser, TCSkultety, MHuth, TPlouffe, BHübner, HAlzheimer, CFriedland, KMüller, CPBouvier, MGmeiner, P Discovery of G Protein-Biased Dopaminergics with a Pyrazolo[1,5-a]pyridine Substructure. J Med Chem 60:2908-2929 (2017)  
Target
Name:
D(2) dopamine receptor
Synonyms:
D(2) dopamine receptor DOPAMINE D2 Long DRD2 Dopamine D2 receptor Dopamine D2 receptor (D2R) Dopamine2-like | d2
Type:
Cell-surface receptors
Mol. Mass.:
50647.10
Organism:
Homo sapiens (Human)
Description:
P14416
Residue:
443
  
Inhibitor
Name:
BDBM50236960
Synonyms:
CHEMBL4060403
Type:
Small organic molecule
Emp. Form.:
C22H23Cl2N5O2
Mol. Mass.:
460.356
SMILES:
Clc1cccc(N2CCN(CCCC(=O)Nc3ccn4ncc(C=O)c4c3)CC2)c1Cl
: