Target
D(2) dopamine receptor
Ligand
BDBM50236956
Substrate
Meas. Tech.
ChEMBL_1660541 (CHEMBL4010153)
Ki
0.500000±n/a nM
Citation
 Möller, DBanerjee, AUzuneser, TCSkultety, MHuth, TPlouffe, BHübner, HAlzheimer, CFriedland, KMüller, CPBouvier, MGmeiner, P Discovery of G Protein-Biased Dopaminergics with a Pyrazolo[1,5-a]pyridine Substructure. J Med Chem 60:2908-2929 (2017)  
Target
Name:
D(2) dopamine receptor
Synonyms:
D(2) dopamine receptor DOPAMINE D2 Long DRD2 Dopamine D2 receptor Dopamine D2 receptor (D2R) Dopamine2-like | d2
Type:
Cell-surface receptors
Mol. Mass.:
50647.10
Organism:
Homo sapiens (Human)
Description:
P14416
Residue:
443
  
Inhibitor
Name:
BDBM50236956
Synonyms:
CHEMBL4069091
Type:
Small organic molecule
Emp. Form.:
C22H24Cl2N6O2
Mol. Mass.:
475.371
SMILES:
O\N=C/c1cnn2ccc(NC(=O)CCCN3CCN(CC3)c3cccc(Cl)c3Cl)cc12
: