Target
Kappa-type opioid receptor
Ligand
BDBM50236882
Substrate
Meas. Tech.
ChEMBL_1659529 (CHEMBL4009141)
Ki
0.980000±n/a nM
Citation
 Soeberdt, MMolenveld, PStorcken, RPBouzanne des Mazery, RSterk, GJAutar, RBolster, MGWagner, CAerts, SNvan Holst, FRWegert, ATangherlini, GFrehland, BSchepmann, DMetze, DLotts, TKnie, ULin, KYHuang, TYLai, CCStänder, SWünsch, BAbels, C Design and Synthesis of Enantiomerically Pure Decahydroquinoxalines as Potent and Selective¿-Opioid Receptor Agonists with Anti-Inflammatory Activity in Vivo. J Med Chem 60:2526-2551 (2017)  
Target
Name:
Kappa-type opioid receptor
Synonyms:
Kappa Opioid Receptor OPRK1 Opiate Kappa 1 | mu/kappa opioid receptor
Type:
G Protein-Coupled Receptor (GPCR)
Mol. Mass.:
42744.99
Organism:
Cavia porcellus (domestic guinea pig)
Description:
P41144
Residue:
380
  
Inhibitor
Name:
BDBM50236882
Synonyms:
CHEMBL4096405
Type:
Small organic molecule
Emp. Form.:
C24H31ClN4O5S
Mol. Mass.:
523.045
SMILES:
[H][C@]12CCC[C@H](N3CC[C@H](O)C3)[C@@]1([H])N(CCN2S(=O)(=O)Cc1ccon1)C(=O)Cc1ccc(Cl)cc1
: