Target
Butyrophilin subfamily 3 member A1
Ligand
BDBM50236892
Substrate
Meas. Tech.
ChEMBL_1659697 (CHEMBL4009309)
EC50
>100000±n/a nM
Citation
 Shippy, RRLin, XAgabiti, SSLi, JZangari, BMFoust, BJPoe, MMHsiao, CCVinogradova, OWiemer, DFWiemer, AJ Phosphinophosphonates and Their Tris-pivaloyloxymethyl Prodrugs Reveal a Negatively Cooperative Butyrophilin Activation Mechanism. J Med Chem 60:2373-2382 (2017)  
Target
Name:
Butyrophilin subfamily 3 member A1
Synonyms:
BT3A1_HUMAN BTN3A1 CD_antigen=CD277
Type:
PROTEIN
Mol. Mass.:
57685.08
Organism:
Homo sapiens (Human)
Description:
ChEMBL_117363
Residue:
513
  
Inhibitor
Name:
BDBM50236892
Synonyms:
CHEMBL4099094
Type:
Small organic molecule
Emp. Form.:
C7H13Na3O5P2
Mol. Mass.:
308.092
SMILES:
[Na+].[Na+].[Na+].[#6]\[#6](-[#6])=[#6]\[#6]-[#6]P([#8-])(=O)[#6]P([#8-])([#8-])=O
: