Target
Aldehyde dehydrogenase, mitochondrial
Ligand
BDBM50236903
Substrate
Meas. Tech.
ChEMBL_1659722 (CHEMBL4009334)
IC50
150±n/a nM
Citation
 Buchman, CDHurley, TD Inhibition of the Aldehyde Dehydrogenase 1/2 Family by Psoralen and Coumarin Derivatives. J Med Chem 60:2439-2455 (2017)  
Target
Name:
Aldehyde dehydrogenase, mitochondrial
Synonyms:
ALDH class 2 ALDH2 ALDHI Aldehyde dehydrogenase (ALDH2)
Type:
Enzyme
Mol. Mass.:
56382.67
Organism:
Homo sapiens (Human)
Description:
P05091
Residue:
517
  
Inhibitor
Name:
BDBM50236903
Synonyms:
CHEMBL4081886
Type:
Small organic molecule
Emp. Form.:
C15H14O3
Mol. Mass.:
242.2699
SMILES:
Cc1coc2c1c(C)cc1oc(=O)c(C)c(C)c21
: