Target
Retinal dehydrogenase 2
Ligand
BDBM50236905
Substrate
Meas. Tech.
ChEMBL_1659727 (CHEMBL4009339)
IC50
130±n/a nM
Citation
 Buchman, CDHurley, TD Inhibition of the Aldehyde Dehydrogenase 1/2 Family by Psoralen and Coumarin Derivatives. J Med Chem 60:2439-2455 (2017)  
Target
Name:
Retinal dehydrogenase 2
Synonyms:
AL1A2_HUMAN Aldehyde dehydrogenase family 1 member A2 RALDH(II) Retinal dehydrogenase 2 | Retinaldehyde-specific dehydrogenase type 2
Type:
PROTEIN
Mol. Mass.:
56720.77
Organism:
Homo sapiens (Human)
Description:
ChEMBL_109700
Residue:
518
  
Inhibitor
Name:
BDBM50236905
Synonyms:
CHEMBL1349972
Type:
Small organic molecule
Emp. Form.:
C16H14O3
Mol. Mass.:
254.2806
SMILES:
Cc1oc2cc3oc(=O)c4CCCc4c3cc2c1C
: