Target
Suppressor of tumorigenicity 14 protein
Ligand
BDBM50236935
Substrate
Meas. Tech.
ChEMBL_1659752 (CHEMBL4009364)
Ki
15000±n/a nM
Citation
 St-Georges, CDésilets, ABéliveau, FGhinet, MDion, SPColombo, ÉBoudreault, PLNajmanovich, RJLeduc, RMarsault, É Modulating the selectivity of matriptase-2 inhibitors with unnatural amino acids. Eur J Med Chem 129:110-123 (2017)  
Target
Name:
Suppressor of tumorigenicity 14 protein
Synonyms:
Epithin MT-SP1 PRSS14 SNC19 ST14_HUMAN Suppressor of tumorigenicity 14 protein TADG15
Type:
Single-pass type II membrane protein
Mol. Mass.:
94769.23
Organism:
Homo sapiens (Human)
Description:
Q9Y5Y6
Residue:
855
  
Inhibitor
Name:
BDBM50236935
Synonyms:
CHEMBL4094168
Type:
Small organic molecule
Emp. Form.:
C38H47N7O4S
Mol. Mass.:
697.889
SMILES:
CC(C)(C)[C@H](NC(=O)[C@H](CCc1ccccc1)NC(=O)CCc1ccccc1)C(=O)N[C@@H](CCCNC(N)=N)C(=O)c1nc2ccccc2s1
: