Target
Cytochrome P450 1B1
Ligand
BDBM50236943
Substrate
Meas. Tech.
ChEBML_1659860
IC50
106±n/a nM
Citation
 Horley, NJBeresford, KJChawla, TMcCann, GJRuparelia, KCGatchie, LSonawane, VRWilliams, ISTan, HLJoshi, PBharate, SSKumar, VBharate, SBChaudhuri, B Discovery and characterization of novel CYP1B1 inhibitors based on heterocyclic chalcones: Overcoming cisplatin resistance in CYP1B1-overexpressing lines. Eur J Med Chem 129:159-174 (2017)  
Target
Name:
Cytochrome P450 1B1
Synonyms:
CP1B1_HUMAN CYPIB1 | Cytochrome P450 1B1 (CYP1B1)
Type:
PROTEIN
Mol. Mass.:
60861.81
Organism:
Homo sapiens (Human)
Description:
ChEMBL_1474523
Residue:
543
  
Inhibitor
Name:
BDBM50236943
Synonyms:
CHEMBL4093676
Type:
Small organic molecule
Emp. Form.:
C16H15NO3
Mol. Mass.:
269.2952
SMILES:
COc1cc(OC)cc(c1)C(=O)\C=C\c1cccnc1
: