Target
Cytochrome P450 1B1
Ligand
BDBM50236955
Substrate
Meas. Tech.
ChEMBL_1659850 (CHEMBL4009462)
EC50
1000±n/a nM
Citation
 Horley, NJBeresford, KJChawla, TMcCann, GJRuparelia, KCGatchie, LSonawane, VRWilliams, ISTan, HLJoshi, PBharate, SSKumar, VBharate, SBChaudhuri, B Discovery and characterization of novel CYP1B1 inhibitors based on heterocyclic chalcones: Overcoming cisplatin resistance in CYP1B1-overexpressing lines. Eur J Med Chem 129:159-174 (2017)  
Target
Name:
Cytochrome P450 1B1
Synonyms:
CP1B1_HUMAN CYPIB1 | Cytochrome P450 1B1 (CYP1B1)
Type:
PROTEIN
Mol. Mass.:
60861.81
Organism:
Homo sapiens (Human)
Description:
ChEMBL_1474523
Residue:
543
  
Inhibitor
Name:
BDBM50236955
Synonyms:
CHEMBL4059677
Type:
Small organic molecule
Emp. Form.:
C18H13NO
Mol. Mass.:
259.3019
SMILES:
O=C(\C=C\c1ccc2ccccc2c1)c1cccnc1
: