Target
Cytochrome P450 1B1
Ligand
BDBM50237129
Substrate
Meas. Tech.
ChEMBL_1659860 (CHEMBL4009472)
IC50
112±n/a nM
Citation
 Horley, NJBeresford, KJChawla, TMcCann, GJRuparelia, KCGatchie, LSonawane, VRWilliams, ISTan, HLJoshi, PBharate, SSKumar, VBharate, SBChaudhuri, B Discovery and characterization of novel CYP1B1 inhibitors based on heterocyclic chalcones: Overcoming cisplatin resistance in CYP1B1-overexpressing lines. Eur J Med Chem 129:159-174 (2017)  
Target
Name:
Cytochrome P450 1B1
Synonyms:
CP1B1_HUMAN CYPIB1 | Cytochrome P450 1B1 (CYP1B1)
Type:
PROTEIN
Mol. Mass.:
60861.81
Organism:
Homo sapiens (Human)
Description:
ChEMBL_1474523
Residue:
543
  
Inhibitor
Name:
BDBM50237129
Synonyms:
CHEMBL4091327
Type:
Small organic molecule
Emp. Form.:
C15H13NO3
Mol. Mass.:
255.2686
SMILES:
COc1ccc(\C=C\C(=O)c2cccnc2)cc1O
: