Target
Cytochrome P450 1A2
Ligand
BDBM50236950
Substrate
Meas. Tech.
ChEMBL_1659862 (CHEMBL4009474)
IC50
752±n/a nM
Citation
 Horley, NJBeresford, KJChawla, TMcCann, GJRuparelia, KCGatchie, LSonawane, VRWilliams, ISTan, HLJoshi, PBharate, SSKumar, VBharate, SBChaudhuri, B Discovery and characterization of novel CYP1B1 inhibitors based on heterocyclic chalcones: Overcoming cisplatin resistance in CYP1B1-overexpressing lines. Eur J Med Chem 129:159-174 (2017)  
Target
Name:
Cytochrome P450 1A2
Synonyms:
CP1A2_HUMAN CYPIA2 Cytochrome P(3)450 Cytochrome P450 1A2 (CYP1A2) Cytochrome P450-P3
Type:
Enzyme
Mol. Mass.:
58423.38
Organism:
Homo sapiens (Human)
Description:
P05177
Residue:
516
  
Inhibitor
Name:
BDBM50236950
Synonyms:
CHEMBL4099058
Type:
Small organic molecule
Emp. Form.:
C15H13NO2
Mol. Mass.:
239.2692
SMILES:
COc1cccc(\C=C\C(=O)c2cccnc2)c1
: