Target
Cytochrome P450 1A1
Ligand
BDBM50237128
Substrate
Meas. Tech.
ChEMBL_1659861 (CHEMBL4009473)
IC50
2200±n/a nM
Citation
 Horley, NJBeresford, KJChawla, TMcCann, GJRuparelia, KCGatchie, LSonawane, VRWilliams, ISTan, HLJoshi, PBharate, SSKumar, VBharate, SBChaudhuri, B Discovery and characterization of novel CYP1B1 inhibitors based on heterocyclic chalcones: Overcoming cisplatin resistance in CYP1B1-overexpressing lines. Eur J Med Chem 129:159-174 (2017)  
Target
Name:
Cytochrome P450 1A1
Synonyms:
CP1A1_HUMAN CYPIA1 Cytochrome P450 1A1 P450 form 6 P450-P1
Type:
Protein
Mol. Mass.:
58177.23
Organism:
Homo sapiens (Human)
Description:
P04798
Residue:
512
  
Inhibitor
Name:
BDBM50237128
Synonyms:
CHEMBL4069375
Type:
Small organic molecule
Emp. Form.:
C24H15NO
Mol. Mass.:
333.382
SMILES:
O=C(\C=C\c1cccnc1)c1ccc2ccc3cccc4ccc1c2c34
: