Target
Cytochrome P450 2C19
Ligand
BDBM50236947
Substrate
Meas. Tech.
ChEMBL_1659866 (CHEMBL4009478)
IC50
>20000±n/a nM
Citation
 Horley, NJBeresford, KJChawla, TMcCann, GJRuparelia, KCGatchie, LSonawane, VRWilliams, ISTan, HLJoshi, PBharate, SSKumar, VBharate, SBChaudhuri, B Discovery and characterization of novel CYP1B1 inhibitors based on heterocyclic chalcones: Overcoming cisplatin resistance in CYP1B1-overexpressing lines. Eur J Med Chem 129:159-174 (2017)  
Target
Name:
Cytochrome P450 2C19
Synonyms:
CP2CJ_HUMAN CYPIIC17 Cytochrome P450 2C19 (CYP2C19) Mephenytoin 4-hydroxylase P450-254C
Type:
Enzyme
Mol. Mass.:
55935.47
Organism:
Homo sapiens (Human)
Description:
P33261
Residue:
490
  
Inhibitor
Name:
BDBM50236947
Synonyms:
CHEMBL4092737
Type:
Small organic molecule
Emp. Form.:
C19H15NO2
Mol. Mass.:
289.3279
SMILES:
COc1ccc2cc(ccc2c1)C(=O)\C=C\c1cccnc1
: