Target
Epidermal growth factor receptor
Ligand
BDBM50237116
Substrate
Meas. Tech.
ChEBML_1661463
IC50
130±n/a nM
Citation
 Hamed, MMDarwish, SSHerrmann, JAbadi, AHEngel, M First Bispecific Inhibitors of the Epidermal Growth Factor Receptor Kinase and the NF-żB Activity As Novel Anticancer Agents. J Med Chem 60:2853-2868 (2017)  
Target
Name:
Epidermal growth factor receptor
Synonyms:
EGF Receptor Substrate EGFR_HUMAN ERBB1 Epidermal Growth Factor Receptor erbB-1 Epidermal growth factor receptor (EGFR) HER1 Proto-oncogene c-ErbB-1 Tyrosine-Protein Kinase ErbB-1
Type:
Receptor Kinase Domain
Mol. Mass.:
134279.59
Organism:
Homo sapiens (Human)
Description:
P00533
Residue:
1210
  
Inhibitor
Name:
BDBM50237116
Synonyms:
CHEMBL4077608
Type:
Small organic molecule
Emp. Form.:
C18H11ClF3N7S2
Mol. Mass.:
481.905
SMILES:
FC(F)(F)c1nnc(NC(=S)Nc2ccc3ncnc(Nc4cccc(Cl)c4)c3c2)s1
: