Target
Solute carrier family 22 member 1
Ligand
BDBM181119
Substrate
Meas. Tech.
ChEMBL_1659986 (CHEMBL4009598)
IC50
149000±n/a nM
Citation
 Chen, ECKhuri, NLiang, XStecula, AChien, HCYee, SWHuang, YSali, AGiacomini, KM Discovery of Competitive and Noncompetitive Ligands of the Organic Cation Transporter 1 (OCT1; SLC22A1). J Med Chem 60:2685-2696 (2017)  
Target
Name:
Solute carrier family 22 member 1
Synonyms:
Adrenergic Alpha Organic cation transporter 1 SLC22A1 hOCT1
Type:
Enzyme Catalytic Domain
Mol. Mass.:
61154.85
Organism:
Homo sapiens (Human)
Description:
Adrenergic Alpha 0 HUMAN::O15245
Residue:
554
  
Inhibitor
Name:
BDBM181119
Synonyms:
US9138393, Cimetidine | US9144538, Cimetidine
Type:
Small organic molecule
Emp. Form.:
C10H16N6S
Mol. Mass.:
252.339
SMILES:
CN\C(NC#N)=N\CCSCc1nc[nH]c1C
: