Target
[Pyruvate dehydrogenase (acetyl-transferring)] kinase isozyme 3, mitochondrial
Ligand
BDBM50414944
Substrate
Meas. Tech.
ChEBML_1660050
Ki
2850±n/a nM
Citation
 Liu, YXie, ZZhao, DZhu, JMao, FTang, SXu, HLuo, CGeng, MHuang, MLi, J Development of the First Generation of Disulfide-Based Subtype-Selective and Potent Covalent Pyruvate Dehydrogenase Kinase 1 (PDK1) Inhibitors. J Med Chem 60:2227-2244 (2017)  
Target
Name:
[Pyruvate dehydrogenase (acetyl-transferring)] kinase isozyme 3, mitochondrial
Synonyms:
PDHK3 PDK3_HUMAN Pyruvate dehydrogenase kinase 3 (PDK3) [Pyruvate dehydrogenase (acetyl-transferring)] kinase isozyme 3, mitochondrial
Type:
Enzyme
Mol. Mass.:
46944.89
Organism:
Homo sapiens (Human)
Description:
Q15120
Residue:
406
  
Inhibitor
Name:
BDBM50414944
Synonyms:
CHEMBL121556 | NSC-402538
Type:
Small organic molecule
Emp. Form.:
C10H16N2O2S4
Mol. Mass.:
324.506
SMILES:
S=C(SSC(=S)N1CCOCC1)N1CCOCC1
: