Target
Leucyl-cystinyl aminopeptidase
Ligand
BDBM50236826
Substrate
Meas. Tech.
ChEBML_1661765
Ki
18±n/a nM
Citation
 Mpakali, ASaridakis, EHarlos, KZhao, YKokkala, PGeorgiadis, DGiastas, PPapakyriakou, AStratikos, E Ligand-Induced Conformational Change of Insulin-Regulated Aminopeptidase: Insights on Catalytic Mechanism and Active Site Plasticity. J Med Chem 60:2963-2972 (2017)  
Target
Name:
Leucyl-cystinyl aminopeptidase
Synonyms:
Aminopeptidase Cystinyl aminopeptidase Insulin-regulated membrane aminopeptidase LCAP_HUMAN Leucyl-cystinyl aminopeptidase, pregnancy serum form Oxytocinase Placental leucine aminopeptidase
Type:
PROTEIN
Mol. Mass.:
117334.10
Organism:
Homo sapiens (Human)
Description:
ChEMBL_1473494
Residue:
1025
  
Inhibitor
Name:
BDBM50236826
Synonyms:
CHEMBL4065841
Type:
Small organic molecule
Emp. Form.:
C35H40N3O4P
Mol. Mass.:
597.6836
SMILES:
N[C@@H](CCc1ccccc1)P(O)(=O)C[C@@H](CC(c1ccccc1)c1ccccc1)C(=O)N[C@@H](Cc1ccccc1)C(N)=O
: