Target
Dual specificity calcium/calmodulin-dependent 3',5'-cyclic nucleotide phosphodiesterase 1B
Ligand
BDBM50059026
Substrate
Meas. Tech.
ChEMBL_1661910 (CHEMBL4011522)
IC50
48±n/a nM
Citation
 Dyck, BBranstetter, BGharbaoui, THudson, ARBreitenbucher, JGGomez, LBotrous, IMarrone, TBarido, RAllerston, CKCedervall, EPXu, RSridhar, VBarker, RAertgeerts, KSchmelzer, KNeul, DLee, DMassari, MEAndersen, CBSebring, KZhou, XPetroski, RLimberis, JAugustin, MChun, LEEdwards, TEPeters, MTabatabaei, A Discovery of Selective Phosphodiesterase 1 Inhibitors with Memory Enhancing Properties. J Med Chem 60:3472-3483 (2017)  
Target
Name:
Dual specificity calcium/calmodulin-dependent 3',5'-cyclic nucleotide phosphodiesterase 1B
Synonyms:
63 kDa Cam-PDE Calcium/calmodulin-dependent 3',5'-cyclic nucleotide phosphodiesterase 1B PDE1B PDE1B_HUMAN Phosphodiesterase 1B Phosphodiesterase Type 1 (PDE1B) | Phosphodiesterase, PDE1/PDE5
Type:
Enzyme
Mol. Mass.:
61366.51
Organism:
Homo sapiens (Human)
Description:
Residue:
536
  
Inhibitor
Name:
BDBM50059026
Synonyms:
5'-Methyl-2'-(biphenylmethyl)-3'-(phenylmethyl)spiro[cyclopentane-1,7'(8'H)-[3H]imidazo[2,1-b]purin]-4(5'H)-one | CHEMBL431377
Type:
Small organic molecule
Emp. Form.:
C32H31N5O
Mol. Mass.:
501.6214
SMILES:
CN1C2=NC3(CCCC3)CN2c2nc(Cc3ccc(cc3)-c3ccccc3)n(Cc3ccccc3)c2C1=O
: