Target
Tyrosyl-DNA phosphodiesterase 1
Ligand
BDBM50237812
Substrate
Meas. Tech.
ChEBML_1661954
IC50
1000±n/a nM
Citation
 Wang, PElsayed, MSAPlescia, CBRavji, ARedon, CEKiselev, EMarchand, CZeleznik, OAgama, KPommier, YCushman, M Synthesis and Biological Evaluation of the First Triple Inhibitors of Human Topoisomerase 1, Tyrosyl-DNA Phosphodiesterase 1 (Tdp1), and Tyrosyl-DNA Phosphodiesterase 2 (Tdp2). J Med Chem 60:3275-3288 (2017)  
Target
Name:
Tyrosyl-DNA phosphodiesterase 1
Synonyms:
TDP1 Tyrosyl-DNA phosphodiesterase 1 | Tyrosyl-DNA phosphodiesterase 1 (TDP1)
Type:
Enzyme
Mol. Mass.:
68430.66
Organism:
Homo sapiens (Human)
Description:
Q9NUW8
Residue:
608
  
Inhibitor
Name:
BDBM50237812
Synonyms:
CHEMBL4099532
Type:
Small organic molecule
Emp. Form.:
C21H20N4O5
Mol. Mass.:
408.4073
SMILES:
CCNCCCn1c2-c3ncc(OC)cc3C(=O)c2c2ccc(cc2c1=O)[N+]([O-])=O
: