Target
TGF-beta receptor type-1
Ligand
BDBM50238084
Substrate
Meas. Tech.
ChEMBL_1662764 (CHEMBL4012445)
EC50
7.9±n/a nM
Citation
 Sabat, MWang, HScorah, NLawson, JDAtienza, JKamran, RHixon, MSDougan, DR Design, synthesis and optimization of 7-substituted-pyrazolo[4,3-b]pyridine ALK5 (activin receptor-like kinase 5) inhibitors. Bioorg Med Chem Lett 27:1955-1961 (2017)  
Target
Name:
TGF-beta receptor type-1
Synonyms:
ALK-5 Activin A receptor type II-like protein kinase of 53kD SKR4 TGF-beta receptor type I TGFBR1 TGFR1_HUMAN Transforming growth factor-beta receptor type I
Type:
enzyme
Mol. Mass.:
55968.24
Organism:
Homo sapiens (Human)
Description:
P36897
Residue:
503
  
Inhibitor
Name:
BDBM50238084
Synonyms:
CHEMBL4085333
Type:
Small organic molecule
Emp. Form.:
C21H19F2N5O
Mol. Mass.:
395.4053
SMILES:
CC(O)Cn1ncc2nccc(Nc3cc(ncc3C)-c3cc(F)ccc3F)c12
: