Target
Androgen receptor
Ligand
BDBM50238125
Substrate
Meas. Tech.
ChEMBL_1662820 (CHEMBL4012501)
IC50
0.190000±n/a nM
Citation
 Asano, MHitaka, TImada, TYamada, MMorimoto, MShinohara, HHara, TYamaoka, MSantou, TNakayama, MImai, YHabuka, NYano, JWilson, KFujita, HHasuoka, A Synthesis and biological evaluation of novel selective androgen receptor modulators (SARMs). Part II: Optimization of 4-(pyrrolidin-1-yl)benzonitrile derivatives. Bioorg Med Chem Lett 27:1897-1901 (2017)  
Target
Name:
Androgen receptor
Synonyms:
ANDR_HUMAN Androgen Receptor Androgen receptor/Baculoviral IAP repeat-containing protein 2 Dihydrotestosterone receptor Nuclear receptor subfamily 3 group C member 4
Type:
Receptor
Mol. Mass.:
99185.27
Organism:
Homo sapiens (Human)
Description:
CHO cells were stably transfected with human AR gene.
Residue:
920
  
Inhibitor
Name:
BDBM50238125
Synonyms:
CHEMBL4090028
Type:
Small organic molecule
Emp. Form.:
C13H15ClN2O
Mol. Mass.:
250.724
SMILES:
C[C@H]1[C@@H](O)CCN1c1ccc(C#N)c(Cl)c1C
: