Target
Acetylcholinesterase
Ligand
BDBM50238240
Substrate
Meas. Tech.
ChEMBL_1663551 (CHEMBL4013232)
IC50
60±n/a nM
Citation
 Peauger, LAzzouz, RGembus, VTîntas, MLSopková-de Oliveira Santos, JBohn, PPapamicaël, CLevacher, V Donepezil-Based Central Acetylcholinesterase Inhibitors by Means of a"Bio-Oxidizable" Prodrug Strategy: Design, Synthesis, and in Vitro Biological Evaluation. J Med Chem 60:5909-5926 (2017)  
Target
Name:
Acetylcholinesterase
Synonyms:
ACES_HUMAN Acetylcholinesterase (AChE) | Acetylcholinesterase (human AChE)
Type:
Enzyme
Mol. Mass.:
67792.70
Organism:
Homo sapiens (Human)
Description:
P22303
Residue:
614
  
Inhibitor
Name:
BDBM50238240
Synonyms:
CHEMBL4084371
Type:
Small organic molecule
Emp. Form.:
C26H24BrNO4
Mol. Mass.:
494.377
SMILES:
[Br-].CC(=O)c1c[n+](Cc2ccccc2C)ccc1CC1Cc2cc3OCOc3cc2C1=O
: