Target
A disintegrin and metalloproteinase with thrombospondin motifs 4
Ligand
BDBM194644
Substrate
Meas. Tech.
ChEMBL_1663583 (CHEMBL4013264)
IC50
2.0±n/a nM
Citation
 Durham, TBMarimuthu, JToth, JLLiu, CAdams, LMudra, DRSwearingen, CLin, CChambers, MGThirunavukkarasu, KWiley, MR A Highly Selective Hydantoin Inhibitor of Aggrecanase-1 and Aggrecanase-2 with a Low Projected Human Dose. J Med Chem 60:5933-5939 (2017)  
Target
Name:
A disintegrin and metalloproteinase with thrombospondin motifs 4
Synonyms:
A disintegrin and metalloproteinase with thrombospondin motifs 4 (ADAMTS-4) ATS4_HUMAN KIAA0688 | Metalloproteinase with thrombospondin motifs 4 (ADAMTS-4)
Type:
Enzyme
Mol. Mass.:
90214.54
Organism:
Homo sapiens (Human)
Description:
O75173
Residue:
837
  
Inhibitor
Name:
BDBM194644
Synonyms:
US9206139, 3
Type:
Small organic molecule
Emp. Form.:
C20H22F3N3O3
Mol. Mass.:
409.4022
SMILES:
FC(F)(F)c1ccc(C[C@@H](C2CC2)C(=O)NC[C@]2(NC(=O)NC2=O)C2CC2)cc1
: