Target
A disintegrin and metalloproteinase with thrombospondin motifs 5
Ligand
BDBM50238241
Substrate
Meas. Tech.
ChEMBL_1663584 (CHEMBL4013265)
IC50
5.0±n/a nM
Citation
 Durham, TBMarimuthu, JToth, JLLiu, CAdams, LMudra, DRSwearingen, CLin, CChambers, MGThirunavukkarasu, KWiley, MR A Highly Selective Hydantoin Inhibitor of Aggrecanase-1 and Aggrecanase-2 with a Low Projected Human Dose. J Med Chem 60:5933-5939 (2017)  
Target
Name:
A disintegrin and metalloproteinase with thrombospondin motifs 5
Synonyms:
A disintegrin and metalloproteinase with thrombospondin motifs 5 (ADAMTS-5) ADAMTS5 ATS5_HUMAN Metalloproteinase with thrombospondin motifs 5 (ADAMTS-5)
Type:
Enzyme
Mol. Mass.:
101769.09
Organism:
Homo sapiens (Human)
Description:
Q9UNA0
Residue:
930
  
Inhibitor
Name:
BDBM50238241
Synonyms:
CHEMBL4102193
Type:
Small organic molecule
Emp. Form.:
C17H18F3N3O3
Mol. Mass.:
369.3383
SMILES:
FC(F)(F)c1ccc(CCC(=O)NC[C@]2(NC(=O)NC2=O)C2CC2)cc1
: