Target
Protein mono-ADP-ribosyltransferase PARP4
Ligand
BDBM50238416
Substrate
Meas. Tech.
ChEMBL_1663205 (CHEMBL4012886)
IC50
<5012±n/a nM
Citation
 Thomson, DWWagner, AJBantscheff, MBenson, REDittus, LDuempelfeld, BDrewes, GKrause, JMoore, JTMueller, KPoeckel, DRau, CSalzer, EShewchuk, LHopf, CEmery, JGMuelbaier, M Discovery of a Highly Selective Tankyrase Inhibitor Displaying Growth Inhibition Effects against a Diverse Range of Tumor Derived Cell Lines. J Med Chem 60:5455-5471 (2017)  
Target
Name:
Protein mono-ADP-ribosyltransferase PARP4
Synonyms:
(ARTD4 or PARP4) 2.4.2.- ADP-ribosyltransferase diphtheria toxin-like 4 ADPRTL1 KIAA0177 PARP-4 PARP4 PARPL Poly [ADP-ribose] polymerase 4 VPARP | Vault poly(ADP-ribose) polymerase
Type:
Mol. Mass.:
192563.23
Organism:
Homo sapiens (Human)
Description:
Q9UKK3
Residue:
1724
  
Inhibitor
Name:
BDBM50238416
Synonyms:
CHEMBL4087470
Type:
Small organic molecule
Emp. Form.:
C23H20N10O
Mol. Mass.:
452.4713
SMILES:
O=C(N1CCN(CC1)c1ncccn1)c1ccc(Nc2nc3ccccc3n3nnnc23)cc1
: