Target
Neuronal acetylcholine receptor subunit alpha-3/beta-4
Ligand
BDBM50238584
Substrate
Meas. Tech.
ChEMBL_1663454 (CHEMBL4013135)
IC50
3.9±n/a nM
Citation
 Wu, YZhangsun, DZhu, XKaas, QZhangsun, MHarvey, PJCraik, DJMcIntosh, JMLuo, S a-Conotoxin [S9A]TxID Potently Discriminates betweena3ß4 anda6/a3ß4 Nicotinic Acetylcholine Receptors. J Med Chem 60:5826-5833 (2017)  
Target
Name:
Neuronal acetylcholine receptor subunit alpha-3/beta-4
Synonyms:
Neuronal acetylcholine receptor Alpha-3/Beta-4 Neuronal acetylcholine receptor; alpha3/beta4 | nAChR subtypes alpha3 beta4
Type:
Protein
Mol. Mass.:
Description:
Components:
This complex has 2 components.
Component 1
Name:
Neuronal acetylcholine receptor subunit alpha-3
Synonyms:
ACHA3_RAT Chrna3
Type:
Enzyme
Mol. Mass.:
56995.52
Organism:
Rattus norvegicus (Rat)
Description:
P04757
Residue:
499
  
Component 2
Name:
Neuronal acetylcholine receptor subunit beta-4
Synonyms:
ACHB4_RAT Chrnb4 Neuronal acetylcholine receptor non-alpha-2 chain | Neuronal acetylcholine receptor protein beta-4 subunit
Type:
Enzyme
Mol. Mass.:
55863.89
Organism:
Rattus norvegicus (Rat)
Description:
P12392
Residue:
495
  
Inhibitor
Name:
BDBM50238584
Synonyms:
CHEMBL4089797
Type:
Small organic molecule
Emp. Form.:
C59H94N18O17S5
Mol. Mass.:
1487.813
SMILES:
CC[C@H](C)[C@@H]1NC(=O)[C@@H]2CCCN2C(=O)[C@H](CO)NC(=O)[C@H](CCCSC)NC(=O)[C@H](C)NC(=O)[C@H](C)NC(=O)[C@@H]2CSSC[C@H](NC(=O)CN)C(=O)N[C@@H](CSSC[C@H](NC1=O)C(N)=O)C(=O)N[C@@H](CO)C(=O)N[C@@H](Cc1cnc[nH]1)C(=O)N1CCC[C@H]1C(=O)N[C@@H](C(C)C)C(=O)N2
: