Target
Neuromedin-U receptor 1
Ligand
BDBM50238696
Substrate
Meas. Tech.
ChEMBL_1664051 (CHEMBL4013732)
EC50
1.9±n/a nM
Citation
 Kanematsu-Yamaki, YNishizawa, NKaisho, TNagai, HMochida, TAsakawa, TInooka, HDote, KFujita, HMatsumiya, KHirabayashi, HSakamoto, JOhtaki, TTakekawa, SAsami, T Potent Body Weight-Lowering Effect of a Neuromedin U Receptor 2-selective PEGylated Peptide. J Med Chem 60:6089-6097 (2017)  
Target
Name:
Neuromedin-U receptor 1
Synonyms:
G-protein coupled receptor 66 GPR66 NMUR1 Neuromedin-U receptor 1
Type:
PROTEIN
Mol. Mass.:
47370.42
Organism:
Homo sapiens (Human)
Description:
ChEMBL_103121
Residue:
426
  
Inhibitor
Name:
BDBM50238696
Synonyms:
CHEMBL4087867
Type:
Small organic molecule
Emp. Form.:
C56H79N15O12
Mol. Mass.:
1154.3198
SMILES:
CC(C)C[C@H](NC(=O)[C@H](Cc1ccccc1)NC(=O)[C@H](Cc1ccc(O)cc1)NC(=O)CCN)C(=O)N[C@@H](Cc1ccccc1)C(=O)N[C@@H](CCC(N)=O)C(=O)N1CCC[C@H]1C(=O)N[C@@H](CCCNC(N)=N)C(=O)N[C@@H](CC(N)=O)C(N)=O
: