Target
Lactoperoxidase
Ligand
BDBM50238827
Substrate
Meas. Tech.
ChEMBL_1664243 (CHEMBL4013924)
IC50
>5000±n/a nM
Citation
 Soubhye, JChikh Alard, IAldib, IPrévost, MGelbcke, MDe Carvalho, AFurtmüller, PGObinger, CFlemmig, JTadrent, SMeyer, FRousseau, ANève, JMathieu, VZouaoui Boudjeltia, KDufrasne, FVan Antwerpen, P Discovery of Novel Potent Reversible and Irreversible Myeloperoxidase Inhibitors Using Virtual Screening Procedure. J Med Chem 60:6563-6586 (2017)  
Target
Name:
Lactoperoxidase
Synonyms:
LPO PERL_BOVIN
Type:
Enzyme
Mol. Mass.:
80659.97
Organism:
Bos taurus (Bovine)
Description:
P80025
Residue:
712
  
Inhibitor
Name:
BDBM50238827
Synonyms:
CHEMBL4064328
Type:
Small organic molecule
Emp. Form.:
C15H18FN5
Mol. Mass.:
287.3353
SMILES:
Fc1ccc2[nH]c(nc2c1)[C@@H]1CCN(CC2NC=CN2)C1
: