Target
Probable G-protein coupled receptor 34
Ligand
BDBM50177117
Substrate
Meas. Tech.
ChEMBL_1664555 (CHEMBL4014236)
EC50
180±n/a nM
Citation
 Sayama, MSayama, MSayama, MInoue, AInoue, AInoue, ANakamura, SNakamura, SNakamura, SJung, SJung, SJung, SIkubo, MIkubo, MIkubo, MOtani, YOtani, YOtani, YUwamizu, AUwamizu, AUwamizu, AKishi, TKishi, TKishi, TMakide, KMakide, KMakide, KAoki, JAoki, JAoki, JHirokawa, THirokawa, THirokawa, TOhwada, TOhwada, TOhwada, T Probing the Hydrophobic Binding Pocket of G-Protein-Coupled Lysophosphatidylserine Receptor GPR34/LPS J Med Chem 60:6384-6399 (2017)  
Target
Name:
Probable G-protein coupled receptor 34
Synonyms:
G protein-coupled receptor 34 Gpr34 | Probable G-protein coupled receptor 34
Type:
PROTEIN
Mol. Mass.:
43201.40
Organism:
Mus musculus
Description:
ChEMBL_102842
Residue:
375
  
Inhibitor
Name:
BDBM50177117
Synonyms:
CHEMBL3814092
Type:
Small organic molecule
Emp. Form.:
C31H36NO11P
Mol. Mass.:
629.5914
SMILES:
N[C@@H](COP(O)(=O)O[C@@H]1CCCO[C@@H]1COC(=O)CCc1ccccc1OCc1cccc(Oc2ccccc2)c1)C(O)=O
: