Target
Probable G-protein coupled receptor 34
Ligand
BDBM50238937
Substrate
Meas. Tech.
ChEMBL_1664555 (CHEMBL4014236)
EC50
49±n/a nM
Citation
 Sayama, MSayama, MSayama, MInoue, AInoue, AInoue, ANakamura, SNakamura, SNakamura, SJung, SJung, SJung, SIkubo, MIkubo, MIkubo, MOtani, YOtani, YOtani, YUwamizu, AUwamizu, AUwamizu, AKishi, TKishi, TKishi, TMakide, KMakide, KMakide, KAoki, JAoki, JAoki, JHirokawa, THirokawa, THirokawa, TOhwada, TOhwada, TOhwada, T Probing the Hydrophobic Binding Pocket of G-Protein-Coupled Lysophosphatidylserine Receptor GPR34/LPS J Med Chem 60:6384-6399 (2017)  
Target
Name:
Probable G-protein coupled receptor 34
Synonyms:
G protein-coupled receptor 34 Gpr34 | Probable G-protein coupled receptor 34
Type:
PROTEIN
Mol. Mass.:
43201.40
Organism:
Mus musculus
Description:
ChEMBL_102842
Residue:
375
  
Inhibitor
Name:
BDBM50238937
Synonyms:
CHEMBL4071570
Type:
Small organic molecule
Emp. Form.:
C40H48NO11P
Mol. Mass.:
749.783
SMILES:
CCCCCCOc1ccc(cc1)-c1ccc(Oc2cccc(COc3ccccc3CCC(=O)OCCCOP(O)(=O)OC[C@H](N)C(O)=O)c2)cc1
: