Target
Cytochrome P450 1A2
Ligand
BDBM50014323
Substrate
Meas. Tech.
ChEMBL_1664941 (CHEMBL4014737)
IC50
30±n/a nM
Citation
 Mohd Siddique, MUMcCann, GJSonawane, VRHorley, NGatchie, LJoshi, PBharate, SBJayaprakash, VSinha, BNChaudhuri, B Quinazoline derivatives as selective CYP1B1 inhibitors. Eur J Med Chem 130:320-327 (2017)  
Target
Name:
Cytochrome P450 1A2
Synonyms:
CP1A2_HUMAN CYPIA2 Cytochrome P(3)450 Cytochrome P450 1A2 (CYP1A2) Cytochrome P450-P3
Type:
Enzyme
Mol. Mass.:
58423.38
Organism:
Homo sapiens (Human)
Description:
P05177
Residue:
516
  
Inhibitor
Name:
BDBM50014323
Synonyms:
2-PHENYL-4H-BENZO[H]CHROMEN-4-ONE 7,8-Benzoflavone alpha-naphthoflavone
Type:
Small organic molecule
Emp. Form.:
C19H12O2
Mol. Mass.:
272.2974
SMILES:
O=c1cc(oc2c3ccccc3ccc12)-c1ccccc1
: