Target
Vascular endothelial growth factor receptor 2
Ligand
BDBM84761
Substrate
Meas. Tech.
VEGFR tyrosine kinase inhibition
pH
7.5±0
Temperature
298.15±0 K
IC50
46± 6 nM
Citation
 Kiselyov, ASPiatnitski, EMilligan, DOuyang, X 1H-1,2,4-triazol-3-yl-anilines: novel potent inhibitors of vascular endothelial growth factor receptors 1 and 2. Chem Biol Drug Des 69:331-7 (2007)  
Target
Name:
Vascular endothelial growth factor receptor 2
Synonyms:
CD_antigen=CD309 Fetal liver kinase 1 (FLK-1) KDR Protein-tyrosine kinase receptor Flk-1 VEGFR-2 VEGFR2 Vascular Endothelial Growth Factor Receptor Kinase 2 Vascular endothelial growth factor receptor 2 (KDR) Vascular endothelial growth factor receptor 2 (VEGFR2) Vascular endothelial growth factor receptor-2 (VEGFR-2)
Type:
Receptor Tyrosine Kinase
Mol. Mass.:
151510.97
Organism:
Homo sapiens (Human)
Description:
P35968
Residue:
1356
  
Inhibitor
Name:
BDBM84761
Synonyms:
(15) 1H-1,2,4-triazol-3-yl-anilines 3-Br-(C6H4) 4-Pyridine
Type:
Emp. Form.:
C19H14BrN5
Mol. Mass.:
392.252
SMILES:
Brc1cccc(c1)-n1cnc(n1)-c1ccccc1Nc1ccncc1
: