Target
Vascular endothelial growth factor receptor 1
Ligand
BDBM84769
Substrate
Meas. Tech.
VEGFR tyrosine kinase inhibition
pH
7.5±0
Temperature
298.15±0 K
IC50
5.9e+2± 8e+1 nM
Citation
 Kiselyov, ASPiatnitski, EMilligan, DOuyang, X 1H-1,2,4-triazol-3-yl-anilines: novel potent inhibitors of vascular endothelial growth factor receptors 1 and 2. Chem Biol Drug Des 69:331-7 (2007)  
Target
Name:
Vascular endothelial growth factor receptor 1
Synonyms:
FLT FRT Fms-like tyrosine kinase 1 Tyrosine-protein kinase FRT VEGFR-1 VGFR1_HUMAN Vascular endothelial growth factor receptor 1 (FLT1) Vascular endothelial growth factor receptor 1 and 2 (Flt-1 and KDR) Vascular permeability factor receptor vascular endothelial growth factor/vascular permeability factor receptor
Type:
Receptor Tyrosine Kinase
Mol. Mass.:
150800.23
Organism:
Homo sapiens (Human)
Description:
P17948
Residue:
1338
  
Inhibitor
Name:
BDBM84769
Synonyms:
(23) 1H-1,2,4-triazol-3-yl-anilines 3,4-di-MeO(C6H4) 4-Pyridine
Type:
Emp. Form.:
C21H19N5O2
Mol. Mass.:
373.4079
SMILES:
COc1ccc(cc1OC)-n1cnc(n1)-c1ccccc1Nc1ccncc1
: