Target
Casein kinase I isoform delta
Ligand
BDBM274544
Substrate
Meas. Tech.
Kinase Assay
pH
7.4±n/a
Temperature
298.15±n/a K
IC50
0.159±n/a nM
Comments
extracted
Citation
 Velaparthi, UDarne, CPDodd, DSSampognaro, AJWittman, MDKumaravel, SMullick, DLiu, PRachamreddy, CR Substituted imidazoles as casein kinase 1 D/E inhibitors US Patent  US9556179 Publication Date 1/31/2017 
Target
Name:
Casein kinase I isoform delta
Synonyms:
CKI-delta CSNK1D Casein kinase I delta Casein kinase I isoform delta (CK1D) KC1D_HUMAN | casein kinases 1 delta (CK1 delta)
Type:
Enzyme
Mol. Mass.:
47356.76
Organism:
Homo sapiens (Human)
Description:
P48730
Residue:
415
  
Inhibitor
Name:
BDBM274544
Synonyms:
N-(6-(4-(4-fluorophenyl)-1-(1-(3,3,3-trifluoropropyl)piperidin-4-yl)-1H-imidazol-5-yl)imidazo[1,2-b]pyridazin-2-yl)thiazole-5-carboxamide | US9556179, Compound 115
Type:
Small organic molecule
Emp. Form.:
C27H24F4N8OS
Mol. Mass.:
584.591
SMILES:
Fc1ccc(cc1)-c1ncn(C2CCN(CCC(F)(F)F)CC2)c1-c1ccc2nc(NC(=O)c3cncs3)cn2n1
: