Target
Casein kinase I isoform epsilon
Ligand
BDBM274756
Substrate
Meas. Tech.
Kinase Assay
pH
7.4±n/a
Temperature
298.15±n/a K
IC50
6.86±n/a nM
Comments
extracted
Citation
 Velaparthi, UDarne, CPDodd, DSSampognaro, AJWittman, MDKumaravel, SMullick, DLiu, PRachamreddy, CR Substituted imidazoles as casein kinase 1 D/E inhibitors US Patent  US9556179 Publication Date 1/31/2017 
Target
Name:
Casein kinase I isoform epsilon
Synonyms:
Axin-1/Casein kinase I epsilon CKIe Casein kinase 1 epsilon (CK1Ɛ) Casein kinase I isoform epsilon (CK1 epsilon) Casein kinase I isoform epsilon (CK1epsilon) | KC1E_HUMAN
Type:
Protein
Mol. Mass.:
47340.25
Organism:
Homo sapiens (Human)
Description:
P49674
Residue:
416
  
Inhibitor
Name:
BDBM274756
Synonyms:
6-fluoro-N-(6-(4-(4-fluoro- phenyl)-1,2-dimethyl-1H- imidazol-5-yl)imidazo[1,2- b]pyridazin-2-yl)-1H- indole-2-carboxamide | US9556179, Compound 332
Type:
Small organic molecule
Emp. Form.:
C26H19F2N7O
Mol. Mass.:
483.4722
SMILES:
Cc1nc(c(-c2ccc3nc(NC(=O)c4cc5ccc(F)cc5[nH]4)cn3n2)n1C)-c1ccc(F)cc1
: