Target
Casein kinase I isoform delta
Ligand
BDBM274758
Substrate
Meas. Tech.
Kinase Assay
pH
7.4±n/a
Temperature
298.15±n/a K
IC50
0.824±n/a nM
Comments
extracted
Citation
 Velaparthi, UDarne, CPDodd, DSSampognaro, AJWittman, MDKumaravel, SMullick, DLiu, PRachamreddy, CR Substituted imidazoles as casein kinase 1 D/E inhibitors US Patent  US9556179 Publication Date 1/31/2017 
Target
Name:
Casein kinase I isoform delta
Synonyms:
CKI-delta CSNK1D Casein kinase I delta Casein kinase I isoform delta (CK1D) KC1D_HUMAN | casein kinases 1 delta (CK1 delta)
Type:
Enzyme
Mol. Mass.:
47356.76
Organism:
Homo sapiens (Human)
Description:
P48730
Residue:
415
  
Inhibitor
Name:
BDBM274758
Synonyms:
N-(6-(4-(4-fluorophenyl)-1,2- dimethyl-1H-imidazol-5-yl) imidazo[1,2-b]pyridazin-2- yl)-1H-pyrrolo[3,2-c] pyridine-3-carboxamide | US9556179, Compound 334
Type:
Small organic molecule
Emp. Form.:
C26H20FN7O
Mol. Mass.:
465.4817
SMILES:
Cc1nc(c(-c2ccc3nc(NC(=O)C4=CCc5ccncc45)cn3n2)n1C)-c1ccc(F)cc1
: