Target
Casein kinase I isoform delta
Ligand
BDBM274785
Substrate
Meas. Tech.
Kinase Assay
pH
7.4±n/a
Temperature
298.15±n/a K
IC50
74.8±n/a nM
Comments
extracted
Citation
 Velaparthi, UDarne, CPDodd, DSSampognaro, AJWittman, MDKumaravel, SMullick, DLiu, PRachamreddy, CR Substituted imidazoles as casein kinase 1 D/E inhibitors US Patent  US9556179 Publication Date 1/31/2017 
Target
Name:
Casein kinase I isoform delta
Synonyms:
CKI-delta CSNK1D Casein kinase I delta Casein kinase I isoform delta (CK1D) KC1D_HUMAN | casein kinases 1 delta (CK1 delta)
Type:
Enzyme
Mol. Mass.:
47356.76
Organism:
Homo sapiens (Human)
Description:
P48730
Residue:
415
  
Inhibitor
Name:
BDBM274785
Synonyms:
N-(6-(4-(4-fluorophenyl)-1,2- dimethyl-1H-imidazol-5-yl) imidazo[1,2-b]pyridazin-2- yl)-3-methyl-4-isoxazole- carboxamide | US9556179, Compound 361
Type:
Small organic molecule
Emp. Form.:
C22H18FN7O2
Mol. Mass.:
431.4224
SMILES:
Cc1nocc1C(=O)Nc1cn2nc(ccc2n1)-c1c(nc(C)n1C)-c1ccc(F)cc1
: