Target
Casein kinase I isoform epsilon
Ligand
BDBM274908
Substrate
Meas. Tech.
Kinase Assay
pH
7.4±n/a
Temperature
298.15±n/a K
IC50
6.40±n/a nM
Comments
extracted
Citation
 Velaparthi, UDarne, CPDodd, DSSampognaro, AJWittman, MDKumaravel, SMullick, DLiu, PRachamreddy, CR Substituted imidazoles as casein kinase 1 D/E inhibitors US Patent  US9556179 Publication Date 1/31/2017 
Target
Name:
Casein kinase I isoform epsilon
Synonyms:
Axin-1/Casein kinase I epsilon CKIe Casein kinase 1 epsilon (CK1Ɛ) Casein kinase I isoform epsilon (CK1 epsilon) Casein kinase I isoform epsilon (CK1epsilon) | KC1E_HUMAN
Type:
Protein
Mol. Mass.:
47340.25
Organism:
Homo sapiens (Human)
Description:
P49674
Residue:
416
  
Inhibitor
Name:
BDBM274908
Synonyms:
3-(2-(2- Fluoroisonicotinamido) imidazo[1,2- b]pyridazin-6-yl)-2- (4-fluorophenyl)-N- (3,3,3-trifluoropropyl)-5,6- dihydroimidazo[1,2- a]pyrazine-7(8H)- carboxamide | US9556179, Compound 486
Type:
Small organic molecule
Emp. Form.:
C28H22F5N9O2
Mol. Mass.:
611.5254
SMILES:
Fc1ccc(cc1)-c1nc2CN(CCn2c1-c1ccc2nc(NC(=O)c3ccnc(F)c3)cn2n1)C(=O)NCCC(F)(F)F
: