Target
Heme oxygenase 2
Ligand
BDBM84831
Substrate
Meas. Tech.
Heme Oxygenase
pH
7.4±0
Temperature
298.15±0 K
IC50
9.0e+4± 3.3e+4 nM
Citation
 Roman, GRahman, MNVukomanovic, DJia, ZNakatsu, KSzarek, WA Heme oxygenase inhibition by 2-oxy-substituted 1-azolyl-4-phenylbutanes: effect of variation of the azole moiety. X-ray crystal structure of human heme oxygenase-1 in complex with 4-phenyl-1-(1H-1,2,4-triazol-1-yl)-2-butanone. Chem Biol Drug Des 75:68-90 (2010)  
Target
Name:
Heme oxygenase 2
Synonyms:
HMOX2_RAT Heme oxygenase 2 | Hmox2
Type:
Enzyme
Mol. Mass.:
35754.99
Organism:
Rattus norvegicus (rat)
Description:
HO-2 obtained from rat brain was used in enzyme assays.
Residue:
315
  
Inhibitor
Name:
BDBM84831
Synonyms:
1-azolyl-4-phenyl-2-butanone, 33
Type:
Emp. Form.:
C18H17N3O
Mol. Mass.:
291.3471
SMILES:
O=C(CCc1ccccc1)Cn1cnc(n1)-c1ccccc1
: