Target
5-hydroxytryptamine receptor 2A
Ligand
BDBM84939
Substrate
Ki
57.2±n/a nM
Comments
PDSP_1130
Citation
 Nelson, DLLucaites, VLAudia, JENissen, JSWainscott, DB Species differences in the pharmacology of the 5-hydroxytryptamine2 receptor: structurally specific differentiation by ergolines and tryptamines. J Pharmacol Exp Ther 265:1272-9 (1993) Target
Name:
5-hydroxytryptamine receptor 2A
Synonyms:
5-HT-2 5-HT2 5HT2A_PIG Serotonin 2a (5-HT2a) receptor
Type:
Enzyme Catalytic Domain
Mol. Mass.:
52679.13
Organism:
PIG
Description:
5-HT2 0 0::P50129
Residue:
470
  
Inhibitor
Name:
BDBM84939
Synonyms:
1,6-Dimethylergoline-8β-carboxylic acid 2-hydroxy-1-methylpropyl ester LY-108742
Type:
Small organic molecule
Emp. Form.:
C21H28N2O3
Mol. Mass.:
356.4586
SMILES:
CC(O)C(C)OC(=O)[C@@H]1C[C@H]2[C@@H](Cc3cn(C)c4cccc2c34)N(C)C1
: